[TextEditor-mcc] Re: Texteditor on AROS

  • From: "Gianfranco \"ShInKurO\" Gignina" <sh1nkur0@xxxxxxxxx>
  • To: texteditor_mcc@xxxxxxxxxxxxx
  • Date: Sun, 17 May 2009 07:48:07 +0200

I don't know why this mail is blocked by ml... Now I try to send it with all
output pasted into body of mail...

Il 15-Mag-2009, Thore Böckelmann scrisse:

> You must use "OS=aros" instead of "os=aros". Without a valid OS
> information OS=os4 is assumed.

Here 3 different output problems... I suppose you are able to compile now
for all systems and I've checkout TE sources from linux without any change
by me :)



shinkuro@debian:~/Documenti/texteditor-mcc/trunk/mcc$ make OS=aros
  CC library.c
library.c:23:24: error: proto/exec.h: No such file or directory
In file included from library.c:33:
private.h:26:31: error: graphics/rastport.h: No such file or directory
private.h:27:32: error: libraries/iffparse.h: No such file or directory
In file included from private.h:29,
                 from library.c:33:
../include/libraries/mui.h:110:24: error: exec/types.h: No such file or
directory
../include/libraries/mui.h:114:21: error: dos/dos.h: No such file or
directory
../include/libraries/mui.h:118:31: error: intuition/classes.h: No such file
or directory
../include/libraries/mui.h:122:31: error: intuition/screens.h: No such file
or directory
../include/libraries/mui.h:126:29: error: proto/intuition.h: No such file or
directory
In file included from private.h:29,
                 from library.c:33:
../include/libraries/mui.h:209: error: expected specifier-qualifier-list
before ULONG
../include/libraries/mui.h:216: error: expected specifier-qualifier-list
before LONG
../include/libraries/mui.h:254: error: field node has incomplete type
../include/libraries/mui.h:256: error: expected specifier-qualifier-list
before ULONG
../include/libraries/mui.h:301: error: expected specifier-qualifier-list
before LONG
../include/libraries/mui.h:496: error: expected specifier-qualifier-list
before LONG
../include/libraries/mui.h:512: error: field ihn_Node has incomplete type
../include/libraries/mui.h:513: error: expected specifier-qualifier-list
before Object
../include/libraries/mui.h:544: error: field ehn_Node has incomplete type
../include/libraries/mui.h:545: error: expected specifier-qualifier-list
before BYTE
../include/libraries/mui.h:568: error: expected specifier-qualifier-list
before LONG
../include/libraries/mui.h:1077: error: expected specifier-qualifier-list
before ULONG
../include/libraries/mui.h:1138: error: expected specifier-qualifier-list
before ULONG
../include/libraries/mui.h:1139: error: expected specifier-qualifier-list
before ULONG
../include/libraries/mui.h:1140: error: expected specifier-qualifier-list
before ULONG
../include/libraries/mui.h:1141: error: expected specifier-qualifier-list
before ULONG
../include/libraries/mui.h:1142: error: expected specifier-qualifier-list
before ULONG
../include/libraries/mui.h:1143: error: expected specifier-qualifier-list
before ULONG
../include/libraries/mui.h:1144: error: expected specifier-qualifier-list
before ULONG
../include/libraries/mui.h:1145: error: expected specifier-qualifier-list
before ULONG
../include/libraries/mui.h:1146: error: expected specifier-qualifier-list
before ULONG
../include/libraries/mui.h:1147: error: expected specifier-qualifier-list
before ULONG
../include/libraries/mui.h:1148: error: expected specifier-qualifier-list
before ULONG
../include/libraries/mui.h:1149: error: expected specifier-qualifier-list
before ULONG
../include/libraries/mui.h:1150: error: expected specifier-qualifier-list
before ULONG
../include/libraries/mui.h:1151: error: expected specifier-qualifier-list
before ULONG
../include/libraries/mui.h:1152: error: expected specifier-qualifier-list
before ULONG
../include/libraries/mui.h:1153: error: expected specifier-qualifier-list
before ULONG
../include/libraries/mui.h:1154: error: expected specifier-qualifier-list
before ULONG
../include/libraries/mui.h:1189: error: expected specifier-qualifier-list
before ULONG
../include/libraries/mui.h:1190: error: expected specifier-qualifier-list
before ULONG
../include/libraries/mui.h:1191: error: expected specifier-qualifier-list
before ULONG
../include/libraries/mui.h:1192: error: expected specifier-qualifier-list
before ULONG
../include/libraries/mui.h:1193: error: expected specifier-qualifier-list
before ULONG
../include/libraries/mui.h:1194: error: expected specifier-qualifier-list
before ULONG
../include/libraries/mui.h:1310: error: expected specifier-qualifier-list
before ULONG
../include/libraries/mui.h:1311: error: expected specifier-qualifier-list
before ULONG
../include/libraries/mui.h:1312: error: expected specifier-qualifier-list
before ULONG
../include/libraries/mui.h:1313: error: expected specifier-qualifier-list
before ULONG
../include/libraries/mui.h:1314: error: expected specifier-qualifier-list
before ULONG
../include/libraries/mui.h:1315: error: expected specifier-qualifier-list
before ULONG
../include/libraries/mui.h:1316: error: expected specifier-qualifier-list
before ULONG
../include/libraries/mui.h:1317: error: expected specifier-qualifier-list
before ULONG
../include/libraries/mui.h:1318: error: expected specifier-qualifier-list
before ULONG
../include/libraries/mui.h:1319: error: expected specifier-qualifier-list
before ULONG
../include/libraries/mui.h:1320: error: expected specifier-qualifier-list
before ULONG
../include/libraries/mui.h:1321: error: expected specifier-qualifier-list
before ULONG
../include/libraries/mui.h:1322: error: expected specifier-qualifier-list
before ULONG
../include/libraries/mui.h:1323: error: expected specifier-qualifier-list
before ULONG
../include/libraries/mui.h:1324: error: expected specifier-qualifier-list
before ULONG
../include/libraries/mui.h:1325: error: expected specifier-qualifier-list
before ULONG
../include/libraries/mui.h:1326: error: expected specifier-qualifier-list
before ULONG
../include/libraries/mui.h:1327: error: expected specifier-qualifier-list
before ULONG
../include/libraries/mui.h:1402: error: expected specifier-qualifier-list
before ULONG
../include/libraries/mui.h:1403: error: expected specifier-qualifier-list
before ULONG
../include/libraries/mui.h:1404: error: expected specifier-qualifier-list
before ULONG
../include/libraries/mui.h:1405: error: expected specifier-qualifier-list
before ULONG
../include/libraries/mui.h:1406: error: expected specifier-qualifier-list
before ULONG
../include/libraries/mui.h:1407: error: expected specifier-qualifier-list
before ULONG
../include/libraries/mui.h:1408: error: expected specifier-qualifier-list
before ULONG
../include/libraries/mui.h:1409: error: expected specifier-qualifier-list
before ULONG
../include/libraries/mui.h:1410: error: expected specifier-qualifier-list
before ULONG
../include/libraries/mui.h:1411: error: expected specifier-qualifier-list
before ULONG
../include/libraries/mui.h:1412: error: expected specifier-qualifier-list
before ULONG
../include/libraries/mui.h:1413: error: expected specifier-qualifier-list
before ULONG
../include/libraries/mui.h:1551: error: expected specifier-qualifier-list
before ULONG
../include/libraries/mui.h:1552: error: expected specifier-qualifier-list
before ULONG
../include/libraries/mui.h:1553: error: expected specifier-qualifier-list
before ULONG
../include/libraries/mui.h:1554: error: expected specifier-qualifier-list
before ULONG
../include/libraries/mui.h:1555: error: expected specifier-qualifier-list
before ULONG
../include/libraries/mui.h:1556: error: expected specifier-qualifier-list
before ULONG
../include/libraries/mui.h:1557: error: expected specifier-qualifier-list
before ULONG
../include/libraries/mui.h:1558: error: expected specifier-qualifier-list
before ULONG
../include/libraries/mui.h:1559: error: expected specifier-qualifier-list
before ULONG
../include/libraries/mui.h:1560: error: expected specifier-qualifier-list
before ULONG
../include/libraries/mui.h:1561: error: expected specifier-qualifier-list
before ULONG
../include/libraries/mui.h:1562: error: expected specifier-qualifier-list
before ULONG
../include/libraries/mui.h:1563: error: expected specifier-qualifier-list
before ULONG
../include/libraries/mui.h:1564: error: expected specifier-qualifier-list
before ULONG
../include/libraries/mui.h:1565: error: expected specifier-qualifier-list
before ULONG
../include/libraries/mui.h:1566: error: expected specifier-qualifier-list
before ULONG
../include/libraries/mui.h:1567: error: expected specifier-qualifier-list
before ULONG
../include/libraries/mui.h:1568: error: expected specifier-qualifier-list
before ULONG
../include/libraries/mui.h:1569: error: expected specifier-qualifier-list
before ULONG
../include/libraries/mui.h:1570: error: expected specifier-qualifier-list
before ULONG
../include/libraries/mui.h:1857: error: expected specifier-qualifier-list
before ULONG
../include/libraries/mui.h:1858: error: expected specifier-qualifier-list
before ULONG
../include/libraries/mui.h:1958: error: expected specifier-qualifier-list
before ULONG
../include/libraries/mui.h:1959: error: expected specifier-qualifier-list
before ULONG
../include/libraries/mui.h:1960: error: expected specifier-qualifier-list
before ULONG
../include/libraries/mui.h:1961: error: expected specifier-qualifier-list
before ULONG
../include/libraries/mui.h:1962: error: expected specifier-qualifier-list
before ULONG
../include/libraries/mui.h:1963: error: expected specifier-qualifier-list
before ULONG
../include/libraries/mui.h:1964: error: expected specifier-qualifier-list
before ULONG
../include/libraries/mui.h:1965: error: expected specifier-qualifier-list
before ULONG
../include/libraries/mui.h:1966: error: expected specifier-qualifier-list
before ULONG
../include/libraries/mui.h:1967: error: expected specifier-qualifier-list
before ULONG
../include/libraries/mui.h:1968: error: expected specifier-qualifier-list
before ULONG
../include/libraries/mui.h:1969: error: expected specifier-qualifier-list
before ULONG
../include/libraries/mui.h:1970: error: expected specifier-qualifier-list
before ULONG
../include/libraries/mui.h:1971: error: expected specifier-qualifier-list
before ULONG
../include/libraries/mui.h:1972: error: expected specifier-qualifier-list
before ULONG
../include/libraries/mui.h:2074: error: expected specifier-qualifier-list
before ULONG
../include/libraries/mui.h:2125: error: expected specifier-qualifier-list
before ULONG
../include/libraries/mui.h:2126: error: expected specifier-qualifier-list
before ULONG
../include/libraries/mui.h:2127: error: expected specifier-qualifier-list
before ULONG
../include/libraries/mui.h:2128: error: expected specifier-qualifier-list
before ULONG
../include/libraries/mui.h:2129: error: expected specifier-qualifier-list
before ULONG
../include/libraries/mui.h:2130: error: expected specifier-qualifier-list
before ULONG
../include/libraries/mui.h:2280: error: expected specifier-qualifier-list
before ULONG
../include/libraries/mui.h:2281: error: expected specifier-qualifier-list
before ULONG
../include/libraries/mui.h:2282: error: expected specifier-qualifier-list
before ULONG
../include/libraries/mui.h:2319: error: expected specifier-qualifier-list
before ULONG
../include/libraries/mui.h:2320: error: expected specifier-qualifier-list
before ULONG
../include/libraries/mui.h:2321: error: expected specifier-qualifier-list
before ULONG
../include/libraries/mui.h:2408: error: expected specifier-qualifier-list
before ULONG
../include/libraries/mui.h:2409: error: expected specifier-qualifier-list
before ULONG
../include/libraries/mui.h:2666: error: expected specifier-qualifier-list
before ULONG
../include/libraries/mui.h:2667: error: expected specifier-qualifier-list
before ULONG
../include/libraries/mui.h:2768: error: expected specifier-qualifier-list
before ULONG
../include/libraries/mui.h:2769: error: expected specifier-qualifier-list
before ULONG
../include/libraries/mui.h:2770: error: expected specifier-qualifier-list
before ULONG
../include/libraries/mui.h:2771: error: expected specifier-qualifier-list
before ULONG
../include/libraries/mui.h:2772: error: expected specifier-qualifier-list
before ULONG
../include/libraries/mui.h:2822: error: expected specifier-qualifier-list
before ULONG
../include/libraries/mui.h:2823: error: expected specifier-qualifier-list
before ULONG
../include/libraries/mui.h:2824: error: expected specifier-qualifier-list
before ULONG
../include/libraries/mui.h:2825: error: expected specifier-qualifier-list
before ULONG
../include/libraries/mui.h:2826: error: expected specifier-qualifier-list
before ULONG
../include/libraries/mui.h:2827: error: expected specifier-qualifier-list
before ULONG
../include/libraries/mui.h:2828: error: expected specifier-qualifier-list
before ULONG
../include/libraries/mui.h:2899: error: expected specifier-qualifier-list
before ULONG
../include/libraries/mui.h:2911: error: expected specifier-qualifier-list
before ULONG
../include/libraries/mui.h:2925: error: expected specifier-qualifier-list
before WORD
../include/libraries/mui.h:2940: error: expected specifier-qualifier-list
before ULONG
../include/libraries/mui.h:2963: error: expected specifier-qualifier-list
before ULONG
../include/libraries/mui.h:3006: error: expected specifier-qualifier-list
before Object
../include/libraries/mui.h:3165: error: expected specifier-qualifier-list
before APTR
In file included from private.h:32,
                 from library.c:33:
../include/mcc_common.h:57:30: error: clib/alib_protos.h: No such file or
directory
In file included from private.h:34,
                 from library.c:33:
../include/mui/TextEditor_mcc.h:106: error: expected
specifier-qualifier-list before ULONG
../include/mui/TextEditor_mcc.h:107: error: expected
specifier-qualifier-list before ULONG
../include/mui/TextEditor_mcc.h:108: error: expected
specifier-qualifier-list before ULONG
../include/mui/TextEditor_mcc.h:109: error: expected
specifier-qualifier-list before ULONG
../include/mui/TextEditor_mcc.h:110: error: expected
specifier-qualifier-list before ULONG
../include/mui/TextEditor_mcc.h:111: error: expected
specifier-qualifier-list before ULONG
../include/mui/TextEditor_mcc.h:112: error: expected
specifier-qualifier-list before ULONG
../include/mui/TextEditor_mcc.h:113: error: expected
specifier-qualifier-list before ULONG
../include/mui/TextEditor_mcc.h:114: error: expected
specifier-qualifier-list before ULONG
../include/mui/TextEditor_mcc.h:115: error: expected
specifier-qualifier-list before ULONG
../include/mui/TextEditor_mcc.h:116: error: expected
specifier-qualifier-list before ULONG
../include/mui/TextEditor_mcc.h:171: error: expected
specifier-qualifier-list before STRPTR
../include/mui/TextEditor_mcc.h:234: error: expected :, ,, ;, } or
__attribute__ before code
In file included from library.c:33:
private.h:181: error: expected specifier-qualifier-list before STRPTR
private.h:198: error: expected specifier-qualifier-list before UWORD
private.h:205: error: expected specifier-qualifier-list before UWORD
private.h:210: error: expected specifier-qualifier-list before BOOL
private.h:220: error: expected specifier-qualifier-list before UWORD
private.h:232: error: expected specifier-qualifier-list before UBYTE
private.h:238: error: expected specifier-qualifier-list before UBYTE
private.h:250: error: expected specifier-qualifier-list before APTR
private.h:267: error: expected specifier-qualifier-list before STRPTR
private.h:275: error: expected specifier-qualifier-list before WORD
private.h:396: error: expected ) before flags
private.h:397: error: expected =, ,, ;, asm or __attribute__ before
MUIG_FreeBitMap
private.h:407: error: expected =, ,, ;, asm or __attribute__ before convert
private.h:408: error: expected =, ,, ;, asm or __attribute__ before
PrintLine
private.h:409: error: expected declaration specifiers or ... before LONG
private.h:409: error: expected declaration specifiers or ... before LONG
private.h:410: error: expected ) before struct
private.h:411: error: expected ) before struct
private.h:412: error: expected ) before struct
private.h:413: error: expected =, ,, ;, asm or __attribute__ before
LineCharsWidth
private.h:414: error: expected =, ,, ;, asm or __attribute__ before
FlowSpace
private.h:415: error: expected =, ,, ;, asm or __attribute__ before
ExpandLine
private.h:416: error: expected =, ,, ;, asm or __attribute__ before
CompressLine
private.h:417: error: expected ) before struct
private.h:418: error: expected ) before struct
private.h:419: error: expected =, ,, ;, asm or __attribute__ before
Init_LineNode
private.h:420: error: expected =, ,, ;, asm or __attribute__ before
VisualHeight
private.h:421: error: expected ) before struct
private.h:422: error: expected =, ,, ;, asm or __attribute__ before
LineToVisual
private.h:424: error: expected =, ,, ;, asm or __attribute__ before
PasteClip
private.h:425: error: expected ) before x
private.h:427: error: expected ) before struct
private.h:428: error: expected =, ,, ;, asm or __attribute__ before
PasteChars
private.h:430: error: expected ) before struct
private.h:431: error: expected ) before struct
private.h:454: error: expected ) before struct
private.h:456: error: expected =, ,, ;, asm or __attribute__ before
RedrawArea
private.h:458: error: expected =, ,, ;, asm or __attribute__ before CutBlock
private.h:461: error: expected =, ,, ;, asm or __attribute__ before GetStyle
private.h:463: error: expected ) before struct
private.h:465: error: expected =, ,, ;, asm or __attribute__ before
MyAllocPooled
private.h:473: error: expected ) before * token
private.h:476: error: expected =, ,, ;, asm or __attribute__ before
HandleARexx
private.h:478: error: expected declaration specifiers or ... before LONG
private.h:478: warning: struct Hook declared inside parameter list
private.h:478: warning: its scope is only this definition or declaration,
which is probably not what you want
private.h:485: error: expected =, ,, ;, asm or __attribute__ before
CutBlock2
private.h:490: error: expected declaration specifiers or ... before ULONG
private.h:494: error: expected =, ,, ;, asm or __attribute__ before
ClearText
private.h:495: error: expected =, ,, ;, asm or __attribute__ before
ToggleCursor
private.h:496: error: expected =, ,, ;, asm or __attribute__ before
InputTrigger
private.h:497: error: expected =, ,, ;, asm or __attribute__ before
InsertText
private.h:508: error: expected =, ,, ;, asm or __attribute__ before Get
private.h:509: error: expected =, ,, ;, asm or __attribute__ before Set
private.h:510: error: expected =, ,, ;, asm or __attribute__ before
HandleInput
private.h:527: error: expected =, ,, ;, asm or __attribute__ before GetColor
private.h:528: error: expected =, ,, ;, asm or __attribute__ before AddColor
private.h:530: error: expected =, ,, ;, asm or __attribute__ before
OM_MarkText
private.h:531: error: expected =, ,, ;, asm or __attribute__ before
OM_BlockInfo
private.h:532: error: expected =, ,, ;, asm or __attribute__ before
OM_Search
private.h:533: error: expected =, ,, ;, asm or __attribute__ before
OM_Replace
private.h:534: error: expected =, ,, ;, asm or __attribute__ before
OM_QueryKeyAction
private.h:539: error: expected ) before * token
private.h:540: error: expected ) before * token
private.h:553: error: expected specifier-qualifier-list before UWORD
private.h:566: error: expected specifier-qualifier-list before BOOL
In file included from library.c:33:
private.h:616: error: expected specifier-qualifier-list before UWORD
In file included from library.c:33:
private.h:626: error: expected =, ,, ;, asm or __attribute__ before xget
In file included from library.c:34:
version.h:53:4: warning: #warning "Unsupported System - check SYSTEM define"
library.c:48: error: NULL undeclared here (not in a function)
library.c:54: warning: initialization from incompatible pointer type
library.c:54: error: initializer element is not constant
library.c:55: warning: initialization from incompatible pointer type
library.c:55: error: initializer element is not constant
library.c:56: warning: initialization from incompatible pointer type
library.c:56: error: initializer element is not constant
library.c:57: warning: initialization from incompatible pointer type
library.c:57: error: initializer element is not constant
library.c:58: warning: initialization from incompatible pointer type
library.c:58: error: initializer element is not constant
library.c:59: warning: initialization from incompatible pointer type
library.c:59: error: initializer element is not constant
library.c:60: warning: initialization from incompatible pointer type
library.c:60: error: initializer element is not constant
library.c:75: error: expected =, ,, ;, asm or __attribute__ before ClassInit
library.c:76: error: expected =, ,, ;, asm or __attribute__ before
ClassExpunge
In file included from library.c:81:
../include/mccinit.c:154:25: error: exec/memory.h: No such file or directory
../include/mccinit.c:155:28: error: exec/libraries.h: No such file or
directory
../include/mccinit.c:156:29: error: exec/semaphores.h: No such file or
directory
../include/mccinit.c:157:27: error: exec/resident.h: No such file or
directory
../include/mccinit.c:158:27: error: exec/execbase.h: No such file or
directory
In file included from ../include/mccinit.c:162,
                 from library.c:81:
../include/proto/muimaster.h:28:29: error: utility/tagitem.h: No such file
or directory
In file included from ../include/proto/muimaster.h:55,
                 from ../include/mccinit.c:162,
                 from library.c:81:
../include/clib/muimaster_protos.h:25: error: expected =, ,, ;, asm or
__attribute__ before * token
../include/clib/muimaster_protos.h:26: error: expected =, ,, ;, asm or
__attribute__ before * token
../include/clib/muimaster_protos.h:27: error: expected =, ,, ;, asm or
__attribute__ before * token
../include/clib/muimaster_protos.h:28: error: expected =, ,, ;, asm or
__attribute__ before * token
../include/clib/muimaster_protos.h:29: error: expected =, ,, ;, asm or
__attribute__ before MUI_DisposeObject
../include/clib/muimaster_protos.h:30: error: expected =, ,, ;, asm or
__attribute__ before MUI_RequestA
../include/clib/muimaster_protos.h:31: error: expected =, ,, ;, asm or
__attribute__ before MUI_Request
../include/clib/muimaster_protos.h:32: error: expected =, ,, ;, asm or
__attribute__ before MUI_Error
../include/clib/muimaster_protos.h:33: error: expected =, ,, ;, asm or
__attribute__ before MUI_AllocAslRequest
../include/clib/muimaster_protos.h:34: error: expected =, ,, ;, asm or
__attribute__ before MUI_AllocAslRequestTags
../include/clib/muimaster_protos.h:35: error: expected =, ,, ;, asm or
__attribute__ before MUI_FreeAslRequest
../include/clib/muimaster_protos.h:36: error: expected =, ,, ;, asm or
__attribute__ before MUI_AslRequest
../include/clib/muimaster_protos.h:37: error: expected =, ,, ;, asm or
__attribute__ before MUI_AslRequestTags
../include/clib/muimaster_protos.h:43: error: expected =, ,, ;, asm or
__attribute__ before MUI_SetError
../include/clib/muimaster_protos.h:45: error: expected =, ,, ;, asm or
__attribute__ before MUI_FreeClass
../include/clib/muimaster_protos.h:46: error: expected =, ,, ;, asm or
__attribute__ before MUI_RequestIDCMP
../include/clib/muimaster_protos.h:47: error: expected =, ,, ;, asm or
__attribute__ before MUI_RejectIDCMP
../include/clib/muimaster_protos.h:48: error: expected =, ,, ;, asm or
__attribute__ before MUI_Redraw
../include/clib/muimaster_protos.h:49: error: expected =, ,, ;, asm or
__attribute__ before MUI_AddClipping
../include/clib/muimaster_protos.h:50: error: expected =, ,, ;, asm or
__attribute__ before MUI_RemoveClipping
../include/clib/muimaster_protos.h:51: error: expected =, ,, ;, asm or
__attribute__ before MUI_AddClipRegion
../include/clib/muimaster_protos.h:52: error: expected =, ,, ;, asm or
__attribute__ before
MUI_RemoveClipRegion../include/clib/muimaster_protos.h:53: error: expected
=, ,, ;, asm or __attribute__ before MUI_BeginRefresh
../include/clib/muimaster_protos.h:54: error: expected =, ,, ;, asm or
__attribute__ before MUI_EndRefresh
../include/clib/muimaster_protos.h:55: error: expected declaration
specifiers or ... before APTR
../include/clib/muimaster_protos.h:56: error: expected =, ,, ;, asm or
__attribute__ before MUI_DeleteCustomClass
../include/clib/muimaster_protos.h:57: error: expected =, ,, ;, asm or
__attribute__ before MUI_ObtainPen
../include/clib/muimaster_protos.h:58: error: expected =, ,, ;, asm or
__attribute__ before MUI_ReleasePen
../include/clib/muimaster_protos.h:64: error: expected =, ,, ;, asm or
__attribute__ before MUI_Layout
In file included from ../include/proto/muimaster.h:62,
                 from ../include/mccinit.c:162,
                 from library.c:81:
../include/inline/muimaster.h:7:27: error: inline/macros.h: No such file or
directory
In file included from library.c:81:
../include/mccinit.c:163:27: error: proto/utility.h: No such file or
directory
../include/mccinit.c:164:23: error: proto/dos.h: No such file or directory
../include/mccinit.c:165:28: error: proto/graphics.h: No such file or
directory
In file included from library.c:81:
../include/mccinit.c:188: warning: initialization from incompatible pointer
type
../include/mccinit.c:188: error: initializer element is not constant
../include/mccinit.c:189: warning: initialization from incompatible pointer
type
../include/mccinit.c:189: error: initializer element is not constant
../include/mccinit.c:193: warning: initialization from incompatible pointer
type
../include/mccinit.c:193: error: initializer element is not constant
../include/mccinit.c:195: warning: initialization from incompatible pointer
type
../include/mccinit.c:195: error: initializer element is not constant
../include/mccinit.c:196: warning: initialization from incompatible pointer
type
../include/mccinit.c:196: error: initializer element is not constant
../include/mccinit.c:197: warning: initialization from incompatible pointer
type
../include/mccinit.c:197: error: initializer element is not constant
../include/mccinit.c:222: warning: initialization from incompatible pointer
type
../include/mccinit.c:222: error: initializer element is not constant
../include/mccinit.c:223: error: expected =, ,, ;, asm or __attribute__
before _Dispatcher
../include/mccinit.c:238: warning: initialization from incompatible pointer
type
../include/mccinit.c:238: error: initializer element is not constant
../include/mccinit.c:277: error: field lh_Library has incomplete type
../include/mccinit.c:278: error: expected specifier-qualifier-list before
UWORD
../include/mccinit.c:307: error: expected declaration specifiers or ...
before BPTR
../include/mccinit.c:308: error: expected =, ,, ;, asm or __attribute__
before LibExpunge
../include/mccinit.c:309: error: expected ) before version
../include/mccinit.c:310: error: expected =, ,, ;, asm or __attribute__
before LibClose
../include/mccinit.c:311: error: expected =, ,, ;, asm or __attribute__
before LibNull
../include/mccinit.c:312: error: expected =, ,, ;, asm or __attribute__
before MCC_Query
../include/mccinit.c: In function Main:
../include/mccinit.c:338: error: RETURN_FAIL undeclared (first use in this
function)
../include/mccinit.c:338: error: (Each undeclared identifier is reported
only once
../include/mccinit.c:338: error: for each function it appears in.)
../include/mccinit.c:338: warning: return makes integer from pointer without
a cast
../include/mccinit.c: At top level:
../include/mccinit.c:342: error: expected =, ,, ;, asm or __attribute__
before LibNull
../include/mccinit.c:462: error: expected =, ,, ;, asm or __attribute__
before const
../include/mccinit.c:475: error: expected =, ,, ;, asm or __attribute__
before const
../include/mccinit.c:486: error: variable ROMTag has initializer but
incomplete type
../include/mccinit.c:488: error: RTC_MATCHWORD undeclared here (not in a
function)
../include/mccinit.c:488: warning: excess elements in struct initializer
../include/mccinit.c:488: warning: (near initialization for ROMTag)
../include/mccinit.c:489: warning: excess elements in struct initializer
../include/mccinit.c:489: warning: (near initialization for ROMTag)
../include/mccinit.c:490: error: invalid use of undefined type struct
Resident
../include/mccinit.c:490: warning: excess elements in struct initializer
../include/mccinit.c:490: warning: (near initialization for ROMTag)
../include/mccinit.c:498: error: RTF_AUTOINIT undeclared here (not in a
function)
../include/mccinit.c:498: warning: excess elements in struct initializer
../include/mccinit.c:498: warning: (near initialization for ROMTag)
../include/mccinit.c:500: warning: excess elements in struct initializer
../include/mccinit.c:500: warning: (near initialization for ROMTag)
../include/mccinit.c:501: error: NT_LIBRARY undeclared here (not in a
function)
../include/mccinit.c:501: warning: excess elements in struct initializer
../include/mccinit.c:501: warning: (near initialization for ROMTag)
../include/mccinit.c:502: warning: excess elements in struct initializer
../include/mccinit.c:502: warning: (near initialization for ROMTag)
../include/mccinit.c:503: warning: excess elements in struct initializer
../include/mccinit.c:503: warning: (near initialization for ROMTag)
../include/mccinit.c:504: warning: excess elements in struct initializer
../include/mccinit.c:504: warning: (near initialization for ROMTag)
../include/mccinit.c:508: error: APTR undeclared here (not in a function)
../include/mccinit.c:508: warning: excess elements in struct initializer
../include/mccinit.c:508: warning: (near initialization for ROMTag)
../include/mccinit.c:508: error: expected } before LibInitTab
../include/mccinit.c:576: error: expected =, ,, ;, asm or __attribute__
before stackswap_call
../include/mccinit.c:590: error: expected =, ,, ;, asm or __attribute__
before callMccFunction
../include/mccinit.c:643: error: expected =, ,, ;, asm or __attribute__
before mccLibInit
../include/mccinit.c:766: error: expected =, ,, ;, asm or __attribute__
before mccLibExpunge
../include/mccinit.c:867: error: expected declaration specifiers or ...
before BPTR
../include/mccinit.c: In function LibInit:
../include/mccinit.c:884: error: BOOL undeclared (first use in this
function)
../include/mccinit.c:884: warning: statement with no effect
../include/mccinit.c:884: error: expected ; before success
../include/mccinit.c:891: error: request for member lib_Node in something
not a structure or union
../include/mccinit.c:891: error: request for member ln_Type in something not
a structure or union
../include/mccinit.c:891: warning: statement with no effect
../include/mccinit.c:892: error: request for member lib_Node in something
not a structure or union
../include/mccinit.c:892: error: request for member ln_Pri in something not
a structure or union
../include/mccinit.c:892: warning: statement with no effect
../include/mccinit.c:893: error: request for member lib_Node in something
not a structure or union
../include/mccinit.c:893: error: request for member ln_Name in something not
a structure or union
../include/mccinit.c:893: warning: statement with no effect
../include/mccinit.c:894: error: request for member lib_Flags in something
not a structure or union
../include/mccinit.c:894: error: LIBF_CHANGED undeclared (first use in this
function)
../include/mccinit.c:894: error: LIBF_SUMUSED undeclared (first use in this
function)
../include/mccinit.c:894: error: invalid operands to binary | (have const
char * const* and const char * const*)
../include/mccinit.c:894: warning: statement with no effect
../include/mccinit.c:895: error: request for member lib_IdString in
something not a structure or union
../include/mccinit.c:895: warning: statement with no effect
../include/mccinit.c:896: error: request for member lib_Version in something
not a structure or union
../include/mccinit.c:896: warning: statement with no effect
../include/mccinit.c:897: error: request for member lib_Revision in
something not a structure or union
../include/mccinit.c:897: warning: statement with no effect
../include/mccinit.c:901: warning: implicit declaration of function
InitSemaphore
../include/mccinit.c:901: error: struct LibraryHeader has no member named
lh_Semaphore
../include/mccinit.c:904: warning: implicit declaration of function
ObtainSemaphore
../include/mccinit.c:904: error: struct LibraryHeader has no member named
lh_Semaphore
../include/mccinit.c:910: error: success undeclared (first use in this
function)
../include/mccinit.c:910: warning: implicit declaration of function
callMccFunction
../include/mccinit.c:910: error: mccLibInit undeclared (first use in this
function)
../include/mccinit.c:910: warning: statement with no effect
../include/mccinit.c:916: warning: implicit declaration of function
ReleaseSemaphore
../include/mccinit.c:916: error: struct LibraryHeader has no member named
lh_Semaphore
../include/mccinit.c:919: error: TRUE undeclared (first use in this
function)
../include/mccinit.c:924: error: struct LibraryHeader has no member named
lh_Segment
../include/mccinit.c:924: error: librarySegment undeclared (first use in
this function)
../include/mccinit.c:924: warning: statement with no effect
../include/mccinit.c:940: warning: return from incompatible pointer type
../include/mccinit.c: At top level:
../include/mccinit.c:961: error: expected =, ,, ;, asm or __attribute__
before LibExpunge
../include/mccinit.c:1022: error: expected declaration specifiers or ...
before ULONG
../include/mccinit.c: In function LibOpen:
../include/mccinit.c:1025: warning: initialization from incompatible pointer
type
../include/mccinit.c:1027: error: request for member lib_OpenCnt in
something not a structure or union
../include/mccinit.c:1040: error: request for member lib_OpenCnt in
something not a structure or union
../include/mccinit.c:1040: error: lvalue required as increment operand
../include/mccinit.c:1040: warning: statement with no effect
../include/mccinit.c:1043: error: request for member lib_Flags in something
not a structure or union
../include/mccinit.c:1043: error: LIBF_DELEXP undeclared (first use in this
function)
../include/mccinit.c:1043: error: wrong type argument to bit-complement
../include/mccinit.c:1043: warning: statement with no effect
../include/mccinit.c: At top level:
../include/mccinit.c:1095: error: expected =, ,, ;, asm or __attribute__
before LibClose
../include/mccinit.c:1159: error: expected =, ,, ;, asm or __attribute__
before MCC_Query
library.c:86: error: expected =, ,, ;, asm or __attribute__ before ClassInit
library.c:152: error: expected =, ,, ;, asm or __attribute__ before
ClassExpunge
make: *** [.obj_aros/library.o] Error 1
shinkuro@debian:~/Documenti/texteditor-mcc/trunk/mcc$



shinkuro@debian:~/Documenti/texteditor-mcc/trunk/mcc$ make OS=mos
  CC library.c
  CC AllocBitMap.c
  CC AllocFunctions.c
  CC BlockOperators.c
  CC CaseConversion.c
  CC ColorOperators.c
  CC Debug.c
  CC Dispatcher.c
  CC EditorStuff.c
EditorStuff.c: In function `utf8_to_ansi':
EditorStuff.c:60: `WCHAR' undeclared (first use in this function)
EditorStuff.c:60: (Each undeclared identifier is reported only once
EditorStuff.c:60: for each function it appears in.)
EditorStuff.c:60: parse error before `wc'
EditorStuff.c:63: warning: implicit declaration of function `UTF8_Decode'
EditorStuff.c:63: `wc' undeclared (first use in this function)
EditorStuff.c:64: warning: implicit declaration of function `ToANSI'
EditorStuff.c:72: `CONST_WSTRPTR' undeclared (first use in this function)
EditorStuff.c:72: parse error before `p'
EditorStuff.c:74: `p' undeclared (first use in this function)
EditorStuff.c:96: parse error before `wc'
EditorStuff.c:106: parse error before `p'
EditorStuff.c: In function `PasteClip':
EditorStuff.c:292: `CODESET_UTF8' undeclared (first use in this function)
make: *** [.obj_mos/EditorStuff.o] Error 1



shinkuro@debian:~/Documenti/texteditor-mcc/trunk/mcc$ make OS=os3
  CC library.c
In file included from library.c:81:
../include/mccinit.c:193: error: conflicting types for 'UtilityBase'
/usr/local/amiga/lib/gcc/m68k-amigaos/3.4.0/../../../../m68k-amigaos/sys-include/proto/utility.h:12:
error: previous declaration of 'UtilityBase' was here
../include/mccinit.c:193: error: conflicting types for 'UtilityBase'
/usr/local/amiga/lib/gcc/m68k-amigaos/3.4.0/../../../../m68k-amigaos/sys-include/proto/utility.h:12:
error: previous declaration of 'UtilityBase' was here
make: *** [.obj_os3/library.o] Error 1
shinkuro@debian:~/Documenti/texteditor-mcc/trunk/mcc$




-- 
Bye, 
Gianfranco "ShInKurO" Gignina

http://shinkuro.amiga.it

-- 
_____________________________________________________________________________
TextEditor ML   - http://www.freelists.org/list/texteditor_mcc
Listserver help - mailto:texteditor_mcc-request@xxxxxxxxxxxxx?Subject=HELP
Bugtracker......: http://sourceforge.net/tracker/?atid=731469&group_id=135025


Other related posts: