[pskmail] Trouble compile fldigi

  • From: "Jesus S" <ea1cfa@xxxxxxxxx>
  • To: pskmail@xxxxxxxxxxxxx
  • Date: Tue, 23 Dec 2008 22:32:09 +0100

Hello everbody:
Thanks for reading this message

I am novice and I am trying install fldigi. Whtat is the meaning of the next

Jesús EA1CFA

g++ -DHAVE_CONFIG_H -I.  -I. -I./include -I./irrxml -I./fileselector
-DNDEBUG  -I/usr/local/include -I/usr/local/include/FL/images
-I/usr/include/freetype2 -D_LARGEFILE_SOURCE -D_LARGEFILE64_SOURCE
-pipe -Wall -fexceptions -O2 -ffast-math -finline-functions  -g -O2 -MT
waterfall.o -MD -MP -MF .deps/waterfall.Tpo -c -o waterfall.o `test -f
'waterfall/waterfall.cxx' || echo './'`waterfall/waterfall.cxx
waterfall/waterfall.cxx: In member function 'void WFdisp::drawScale()':
waterfall/waterfall.cxx:576: error: expected unqualified-id before
waterfall/waterfall.cxx:609: error: expected unqualified-id before '=' token
waterfall/waterfall.cxx:612: error: expected unqualified-id before '=' token
waterfall/waterfall.cxx:614: error: expected primary-expression before
waterfall/waterfall.cxx:614: error: expected `)' before 'unsigned'
waterfall/waterfall.cxx:615: error: expected primary-expression before
make[2]: *** [waterfall.o] Error 1
make[2]: se sale del directorio `/home/jesus/fldigi-3.03/src'
make[1]: *** [all] Error 2
make[1]: se sale del directorio `/home/jesus/fldigi-3.03/src'
make: *** [all-recursive] Error 1

Other related posts: