[uae] Re: problem compiling

  • From: Giorgio Moscardi <useless@xxxxxxxxx>
  • To: uae@xxxxxxxxxxxxx
  • Date: Wed, 7 Apr 2004 12:09:05 +0200

-I/usr/include/gtk-2.0 -I/usr/lib/gtk-2.0/include -I/usr/include/atk-1.0 
-I/usr/include/pango-1.0 -I/usr/X11R6/include -I/usr/include/freetype2 
-I/usr/include/glib-2.0 -I/usr/lib/glib-2.0/include

btw, i got another problem during the rest of the compilation:
gcc -I../src/include -I../src -I../src -I.. -c -O2 -fomit-frame-pointer  -Wall 
-Wno-unused -Wno-format -W -Wmissing-prototypes -Wstrict-prototypes -O2 
-march=i486 -mcpu=i686  -DFPUEMU -DCPUEMU_0 -DCPUEMU_5 -DCPUEMU_6 
-DUNALIGNED_PROFITABLE -fno-strength-reduce 
-DREGPARAM="__attribute__((regparm(3)))" -DOPTIMIZED_FLAGS -DX86_ASSEMBLY 
-o cpuemu_6.o
gcc: Internal error: Killed (program cc1)
Please submit a full bug report.
See <URL:http://gcc.gnu.org/bugs.html> for instructions.
distcc[20649] ERROR: compile on zero failed
make[3]: *** [cpuemu_6.o] Error 1
make[3]: Leaving directory `/tmp/uae-0.8.25-20040302/src'
make[2]: *** [all-recursive] Error 1
make[2]: Leaving directory `/tmp/uae-0.8.25-20040302/src'
make[1]: *** [all] Error 2
make[1]: Leaving directory `/tmp/uae-0.8.25-20040302/src'
make: *** [all-recursive] Error 1

this happened after a few hours (!) it was compiling this file. i'm gonna try 
some patches from the gentoo guys which seem to solve the problem.

thanks so far!

Alle 10:04, mercoledì 7 aprile 2004, Martin Garton ha scritto:
> pkg-config gtk+-2.0 --cflags

------------- Slackware GNU/Linux 9.1 user -------------
ICQ: 10238408
IRC: ^Useless^ @ AzzurraNet
Web: http://www.sukkopera.com - http://www.nyft.org

Other related posts: