• From: "Jesus S" <ea1cfa@xxxxxxxxx>
  • To: pskmail@xxxxxxxxxxxxx
  • Date: Wed, 24 Dec 2008 12:56:09 +0100

Thanks for reply Reian and Ed.
I use Ubuntu 8.04

Jesús EA1CFA

   - *From*: Rein Couperus <rein@xxxxxxxxxxxx>
   - *To*: pskmail@xxxxxxxxxxxxx
   - *Date*: Wed, 24 Dec 2008 12:30:40 +0100

Hi Jesus, I got the following answer from W3NR, who is a fldigi expert:


Can you encourage Jesus to install the binary rather than the source.
Unless he has a specific reason, the binary only requires libhamlib2,
libportaudio2 and maybe libsamplerate.

This is a guess on my part, but I would say he is either using an old
version of FLTK or compiled FLTK without using the 2 needed configure
switches enabling xft and threads. If this is the case he is going to
need many added libs to get FLTK to compile.

But as I said this is just a guess on my part.


which linux version do you use?


Rein PA0R

> -----Ursprüngliche Nachricht-----
> Von: "Jesus S" <ea1cfa@xxxxxxxxx>
> Gesendet: 23.12.08 22:34:04
> An: pskmail@xxxxxxxxxxxxx
> Betreff: [pskmail] Trouble compile fldigi

Hello everbody:
> Thanks for reading this message
> I am novice and I am trying install fldigi. Whtat is the meaning of
> the next text?
> Jesús EA1CFA
> g++ -DHAVE_CONFIG_H -I. -I. -I./include -I./irrxml -I./fileselector -
> DNDEBUG -I/usr/local/include -I/usr/local/include/FL/images -I/usr/
> OFFSET_BITS=64 -D_THREAD_SAFE -D_REENTRANT -I/usr/local/include -pipe
> -Wall -fexceptions -O2 -ffast-math -finline-functions -g -O2 -MT
> waterfall.o -MD -MP -MF .deps/waterfall.Tpo -c -o waterfall.o `test -
> f 'waterfall/waterfall.cxx' || echo './'`waterfall/waterfall.cxx
> waterfall/waterfall.cxx: In member function 'void WFdisp::drawScale()'
> :
> waterfall/waterfall.cxx:576: error: expected unqualified-id before '
> unsigned'
> waterfall/waterfall.cxx:609: error: expected unqualified-id before '='
> token
> waterfall/waterfall.cxx:612: error: expected unqualified-id before '='
> token
> waterfall/waterfall.cxx:614: error: expected primary-expression
> before 'unsigned'
> waterfall/waterfall.cxx:614: error: expected `)' before 'unsigned'
> waterfall/waterfall.cxx:615: error: expected primary-expression
> before 'unsigned'
> make[2]: *** [waterfall.o] Error 1
> make[2]: se sale del directorio `/home/jesus/fldigi-3.03/src'
> make[1]: *** [all] Error 2
> make[1]: se sale del directorio `/home/jesus/fldigi-3.03/src'
> make: *** [all-recursive] Error 1
> jesus@PC-jesus:~/fldigi-3.03$

Other related posts: