[Lugge] problemi con modem USB Atlantis

  • From: metalvalium <metalvalium@xxxxxxxxxxxx>
  • To: lugge <lugge@xxxxxxxxxxxxx>
  • Date: Tue, 27 Jul 2004 01:07:38 +0200

Carissimin amici/che,
mi scuso per la mia lunga assenza in lista ma ho avuto problemi di salute.
Ho una Knoppix 3.3 kernel 2.4... su hard disk (funziona benissimo) ma non rileva il modem interno così ho comprato un modem USB compatibile con linux WEB RUNNER USB (SEGNALO A CHI POTREBBE SERVIRE IL SITO DOVE POTER SCARICARE I DRIVER DICONO kERNEL 2.4 => www.atlantis-land.com) della atlantis ho cercato di installare i driver allegati nella confezione .
Vi scrivo qui sotto le istruzioni presenti e il risultato seguendo scrupolosamente le istruzioni.
Se potete darmi una mano ve ne sarò grato.
un saluto a tutti
Luigi


ISTRUZIONI------------------------------------------------------------------------------
Smart Link Ltd.
http://www.smlink.com
Apr 12, 2002


Smart Link Soft Modem for Linux -------------------------------


Introduction ============

This is Smart Link Soft Modem for Linux version 2.6. It provides
full-featured 56K Voice Fax Modem.


Features ========

Modem: V.90, V.34, V.32bis, V.23, V.22, V.21, Bell 103/212.
Flow control: V.42, MNP 2-4.
Compression: V.44, V.42bis, MNP5.
Fax: Class 1.
Voice: ADPCM voice compression, Digital Answering Machine.


Requirements ============

CPU: Intel Pentiumi II, Celron. AMD K6, Cyrix 400MHz or higher.
Memory: 64MB (may work also with 32MB).
OS: Linux 2.4 series.


Supported Hardware ==================

HAMR5600 based AMR/CNR/MDC/ACR modem cards on the following Southbridge
chips:
- Intel ICH0, ICH2
- Via 686A, 686B, 8231, 8233
- SiS 961, 630
- ALI 1535.
SmartPCI56, SmartPCI561 based PCI modem cards.
SmartUSB56 based USB modem.


Installation ============

1. Unpack tar.gz package file:

   $ gzip -dc slmdm-2.6.X.tar.gz | tar xf -

2. 'cd' to package directory:

   $ cd slmdm-2.6.X

3. Review and edit (if need) 'Makefile'.

  Note: Probably you will want to correct in Makefile path to your
        local linux kernel header files:

            KERNEL_INCLUDES=/path/to/linux/include

        Another way is to pass command line the parameter while
        running 'make':

            $ make KERNEL_INCLUDES=/path/to/linux/include ...

4. Run 'make' command to compile package:

   $ make

5. Install.

  If you are going to use AMR/CNR/PCI modem type (as superuser):

   # make install-amr

  , or

   # make install-usb

  if you are going to use USB modem.

  It will install:
  - modem kernel modules slmdm.o (modem core), slfax.o (fax)
    into '/lib/modules/<kernel-version>/misc' directory
    (standard linux modules' directory).
  - hardware specific kernel module slamrmo.o (for AMR/CNR/PCI) or
    slusb.o (for USB) into '/lib/modules/<kernel-version>/misc'
    directory (standard linux modules' directory).
  - country settings data file 'country.dat' into directory '/etc'.

  Also it will:
  - create character tty device entry '/dev/ttySL0' with major
    number 212 and symbolic link 'dev/modem'.
  - config you '/etc/modules.conf' file in order to provide
    possibility for loading the modem modules into kernel on demand
    automatically by kmod, when you are going to use them.

  Note: currently you cannot use both AMR/CNR/PCI and USB Modems.

6. Config modem country.

  You can configure you current country by using module parameters
  'country' or 'country_code'.
  Add 'options' directive line to file '/etc/modules.conf':

   options slmdm country=<MyCountry>

  , for example

   options slmdm country=USA

  , or use module parameter while module loading:

   # modprobe slmdm country=<MyCountry>

  Use 'slver -c' to see list of all supported countries and their
  codes (utility 'slver' may be found in package directory).

  Note: Command ATI7 shows installed country setting.

7. Using the modem.

  Installation will automatically create character tty device entry
  '/dev/ttySL0' with major number 212 and symbolic link '/dev/modem'.
  Use one of them as modem device for your dialing application.

8. Uninstallation.

  In package directory just type:

   # make uninstall


Using RPM =========

1. Build SRPM and RPM from tar.gz package:

  In order to build RPM and SRPM run command:

   # rpm -ta slmdm-2.6.X.tar.gz

  It will build in your RPM directory:
  - slmdm-2.6.X-Y.src.rpm       - Source SRPM package
  - slmdm-2.6.X-Y.i386.rpm      - Core Modem RPM package
  - slmdm-amr-2.6.X-Y.i386.rpm  - AMR/CNR/PCI Modem driver
  - slmdm-usb-2.6.X-Y.i386.rpm  - USB Modem driver

2. Install

  To install Modem core package run:

   # rpm -i /path/to/slmdm-2.6.X-Y.i386.rpm

  To install Modem hw driver run:

   # rpm -i /path/to/slmdm-amr-2.6.X-Y.i386.rpm

  if you are going to use AMR/CNR/PCI Modem, or

   # rpm -i /path/to/slmdm-usb-2.6.X-Y.i386.rpm

  if you are going to use SmartUSB56 Modem.

Note: currently you cannot install and use both AMR/CNR/PCI and USB Modems.

3. Uninstall.

   # rpm -e slmdm slmdm-<amr|usb>


Getting Started ===============

After successful installation and configuration modules will be loaded on
demand if you are using 'kmod' in linux kernel.

Also you can load modules by hand:

   # modprobe slamrmo

if you are using AMR/CNR/PCI modem, or

   # modprobe slusb

if you are using SmartUSB56 Modem.


Troubleshooting ===============

If you get an error message during installation/configuration or loading
the modules like 'slmdm.o: unresolve symbols ...' it may mean that
package was prepared for different linux kernel version that you have.
Run command 'slver -k' (may be found in package directory) to see what
version of linux kernel was used for preparing package.

Unfortunately it is no so flexible currently (we are working about it) to
support all versions of linux kernel. So try to obtain appropriate release
of the modem package or upgrade kernel.

Please report the problem to your modem provider or to us
(support@xxxxxxxxxx).


Customization =============

Look at 'editme.c' file in package directory.


Feedback ========

Please send any feedbacks to Smart Link. See the Smart Link
web site for contact information (www.smlink.com) or to
support@xxxxxxxxxxx


RISULTATO DELLA CONSOLE-----------------------------------------------------------------


root@box:~/slmdm-2.6.16# KERNEL_INCLUDES=/usr/src/linux/include
root@box:~/slmdm-2.6.16# make KERNEL_INCLUDES=/usr/src/linux/include
gcc -Wall -O3 -fomit-frame-pointer -D__KERNEL__ -DMODULE -DEXPORT_SYMTAB -I. -I/usr/src/linux/include -DMODVERSIONS --include /usr/src/linux/include/linux/modversions.h -o amrmo_init.o -c amrmo_init.c
In file included from /usr/src/linux/include/asm/semaphore.h:39,
from /usr/src/linux/include/linux/fs.h:202,
from /usr/src/linux/include/linux/capability.h:17,
from /usr/src/linux/include/linux/binfmts.h:5,
from /usr/src/linux/include/linux/sched.h:9,
from /usr/src/linux/include/linux/mm.h:4,
from /usr/src/linux/include/linux/slab.h:14,
from /usr/src/linux/include/asm/pci.h:38,
from /usr/src/linux/include/linux/pci.h:679,
from amrmo_init.c:50:
/usr/src/linux/include/asm/system.h: In function `__set_64bit_var':
/usr/src/linux/include/asm/system.h:190: warning: dereferencing type-punned pointer will break strict-aliasing rules
/usr/src/linux/include/asm/system.h:190: warning: dereferencing type-punned pointer will break strict-aliasing rules
gcc -Wall -O3 -fomit-frame-pointer -D__KERNEL__ -DMODULE -DEXPORT_SYMTAB -I. -I/usr/src/linux/include -DMODVERSIONS --include /usr/src/linux/include/linux/modversions.h -o sysdep_pci.o -c sysdep_pci.c
In file included from /usr/src/linux/include/asm/semaphore.h:39,
from /usr/src/linux/include/linux/fs.h:202,
from /usr/src/linux/include/linux/capability.h:17,
from /usr/src/linux/include/linux/binfmts.h:5,
from /usr/src/linux/include/linux/sched.h:9,
from /usr/src/linux/include/linux/mm.h:4,
from sysdep_pci.c:52:
/usr/src/linux/include/asm/system.h: In function `__set_64bit_var':
/usr/src/linux/include/asm/system.h:190: warning: dereferencing type-punned pointer will break strict-aliasing rules
/usr/src/linux/include/asm/system.h:190: warning: dereferencing type-punned pointer will break strict-aliasing rules
ld -r -o slamrmo.o amrmo.o amrmo_init.o sysdep_pci.o
gcc -Wall -O3 -fomit-frame-pointer -D__KERNEL__ -DMODULE -DEXPORT_SYMTAB -I. -I/usr/src/linux/include -DMODVERSIONS --include /usr/src/linux/include/linux/modversions.h -o usb_st7554.o -c usb_st7554.c
In file included from /usr/src/linux/include/asm/semaphore.h:39,
from /usr/src/linux/include/linux/fs.h:202,
from /usr/src/linux/include/linux/capability.h:17,
from /usr/src/linux/include/linux/binfmts.h:5,
from /usr/src/linux/include/linux/sched.h:9,
from /usr/src/linux/include/linux/mm.h:4,
from /usr/src/linux/include/linux/slab.h:14,
from usb_st7554.c:53:
/usr/src/linux/include/asm/system.h: In function `__set_64bit_var':
/usr/src/linux/include/asm/system.h:190: warning: dereferencing type-punned pointer will break strict-aliasing rules
/usr/src/linux/include/asm/system.h:190: warning: dereferencing type-punned pointer will break strict-aliasing rules
usb_st7554.c: At top level:
usb_st7554.c:163: error: parse error before "urb_t"
usb_st7554.c:163: warning: no semicolon at end of struct or union
usb_st7554.c:205: error: parse error before '}' token
usb_st7554.c: In function `mi_init':
usb_st7554.c:338: error: dereferencing pointer to incomplete type
usb_st7554.c:365: error: dereferencing pointer to incomplete type
usb_st7554.c: In function `mi_free':
usb_st7554.c:380: error: dereferencing pointer to incomplete type
usb_st7554.c: In function `mo_init':
usb_st7554.c:399: error: dereferencing pointer to incomplete type
usb_st7554.c:418: error: dereferencing pointer to incomplete type
usb_st7554.c:418: error: dereferencing pointer to incomplete type
usb_st7554.c: In function `mo_free':
usb_st7554.c:431: error: dereferencing pointer to incomplete type
usb_st7554.c: In function `do_modem_bh':
usb_st7554.c:453: error: dereferencing pointer to incomplete type
usb_st7554.c:454: error: dereferencing pointer to incomplete type
usb_st7554.c:455: error: dereferencing pointer to incomplete type
usb_st7554.c:456: error: dereferencing pointer to incomplete type
usb_st7554.c:457: error: dereferencing pointer to incomplete type
usb_st7554.c:463: error: dereferencing pointer to incomplete type
usb_st7554.c:465: error: dereferencing pointer to incomplete type
usb_st7554.c:466: error: dereferencing pointer to incomplete type
usb_st7554.c:467: error: dereferencing pointer to incomplete type
usb_st7554.c:468: error: dereferencing pointer to incomplete type
usb_st7554.c: In function `do_ring_bh':
usb_st7554.c:480: error: dereferencing pointer to incomplete type
usb_st7554.c:481: error: dereferencing pointer to incomplete type
usb_st7554.c: At top level:
usb_st7554.c:487: error: parse error before '*' token
usb_st7554.c: In function `st7554_interrupt':
usb_st7554.c:489: error: `urb' undeclared (first use in this function)
usb_st7554.c:489: error: (Each undeclared identifier is reported only once
usb_st7554.c:489: error: for each function it appears in.)
usb_st7554.c:510: error: dereferencing pointer to incomplete type
usb_st7554.c:511: error: dereferencing pointer to incomplete type
usb_st7554.c:515: error: dereferencing pointer to incomplete type
usb_st7554.c:516: error: dereferencing pointer to incomplete type
usb_st7554.c:521: error: dereferencing pointer to incomplete type
usb_st7554.c: In function `mo_complete':
usb_st7554.c:536: error: dereferencing pointer to incomplete type
usb_st7554.c:537: error: `iso_packet_descriptor_t' undeclared (first use in this function)
usb_st7554.c:537: error: `p' undeclared (first use in this function)
usb_st7554.c:544: error: dereferencing pointer to incomplete type
usb_st7554.c:548: error: dereferencing pointer to incomplete type
usb_st7554.c:552: error: dereferencing pointer to incomplete type
usb_st7554.c:555: error: dereferencing pointer to incomplete type
usb_st7554.c:557: error: dereferencing pointer to incomplete type
usb_st7554.c:558: error: dereferencing pointer to incomplete type
usb_st7554.c:559: error: dereferencing pointer to incomplete type
usb_st7554.c:565: error: dereferencing pointer to incomplete type
usb_st7554.c:569: error: dereferencing pointer to incomplete type
usb_st7554.c:570: error: dereferencing pointer to incomplete type
usb_st7554.c:570: error: dereferencing pointer to incomplete type
usb_st7554.c:571: error: dereferencing pointer to incomplete type
usb_st7554.c:574: error: dereferencing pointer to incomplete type
usb_st7554.c:581: error: dereferencing pointer to incomplete type
usb_st7554.c:585: error: dereferencing pointer to incomplete type
usb_st7554.c:585: error: dereferencing pointer to incomplete type
usb_st7554.c: In function `mo_setup_complete':
usb_st7554.c:597: error: dereferencing pointer to incomplete type
usb_st7554.c:613: error: dereferencing pointer to incomplete type
usb_st7554.c:614: error: dereferencing pointer to incomplete type
usb_st7554.c:614: error: dereferencing pointer to incomplete type
usb_st7554.c:614: error: dereferencing pointer to incomplete type
usb_st7554.c:615: error: dereferencing pointer to incomplete type
usb_st7554.c:616: error: dereferencing pointer to incomplete type
usb_st7554.c: At top level:
usb_st7554.c:624: error: parse error before '*' token
usb_st7554.c: In function `mi_complete':
usb_st7554.c:626: error: `u' undeclared (first use in this function)
usb_st7554.c:627: error: `iso_packet_descriptor_t' undeclared (first use in this function)
usb_st7554.c:627: error: `p' undeclared (first use in this function)
usb_st7554.c:634: error: dereferencing pointer to incomplete type
usb_st7554.c:640: error: dereferencing pointer to incomplete type
usb_st7554.c:644: error: dereferencing pointer to incomplete type
usb_st7554.c:648: error: dereferencing pointer to incomplete type
usb_st7554.c:649: error: dereferencing pointer to incomplete type
usb_st7554.c:655: error: dereferencing pointer to incomplete type
usb_st7554.c:655: error: dereferencing pointer to incomplete type
usb_st7554.c:656: error: dereferencing pointer to incomplete type
usb_st7554.c:659: error: dereferencing pointer to incomplete type
usb_st7554.c:663: error: dereferencing pointer to incomplete type
usb_st7554.c:663: error: dereferencing pointer to incomplete type
usb_st7554.c: At top level:
usb_st7554.c:667: error: parse error before '*' token
usb_st7554.c: In function `mi_setup_complete':
usb_st7554.c:669: error: `u' undeclared (first use in this function)
usb_st7554.c:670: error: `iso_packet_descriptor_t' undeclared (first use in this function)
usb_st7554.c:670: error: `p' undeclared (first use in this function)
usb_st7554.c:677: error: dereferencing pointer to incomplete type
usb_st7554.c:683: error: dereferencing pointer to incomplete type
usb_st7554.c:687: error: dereferencing pointer to incomplete type
usb_st7554.c:691: error: dereferencing pointer to incomplete type
usb_st7554.c:692: error: dereferencing pointer to incomplete type
usb_st7554.c:696: error: dereferencing pointer to incomplete type
usb_st7554.c:696: error: dereferencing pointer to incomplete type
usb_st7554.c:697: error: dereferencing pointer to incomplete type
usb_st7554.c:697: error: dereferencing pointer to incomplete type
usb_st7554.c:697: error: dereferencing pointer to incomplete type
usb_st7554.c:702: error: dereferencing pointer to incomplete type
usb_st7554.c:714: error: dereferencing pointer to incomplete type
usb_st7554.c:714: error: dereferencing pointer to incomplete type
usb_st7554.c: In function `st7554_modem_start':
usb_st7554.c:759: error: dereferencing pointer to incomplete type
usb_st7554.c:759: error: dereferencing pointer to incomplete type
usb_st7554.c:762: error: dereferencing pointer to incomplete type
usb_st7554.c:762: error: dereferencing pointer to incomplete type
usb_st7554.c:762: error: dereferencing pointer to incomplete type
usb_st7554.c:762: error: dereferencing pointer to incomplete type
usb_st7554.c:762: error: dereferencing pointer to incomplete type
usb_st7554.c:762: error: dereferencing pointer to incomplete type
usb_st7554.c:762: error: dereferencing pointer to incomplete type
usb_st7554.c:762: error: dereferencing pointer to incomplete type
usb_st7554.c:762: error: dereferencing pointer to incomplete type
usb_st7554.c:762: error: dereferencing pointer to incomplete type
usb_st7554.c:763: error: dereferencing pointer to incomplete type
usb_st7554.c:763: error: dereferencing pointer to incomplete type
usb_st7554.c:763: error: dereferencing pointer to incomplete type
usb_st7554.c:763: error: dereferencing pointer to incomplete type
usb_st7554.c:763: error: dereferencing pointer to incomplete type
usb_st7554.c:763: error: dereferencing pointer to incomplete type
usb_st7554.c:763: error: dereferencing pointer to incomplete type
usb_st7554.c:763: error: dereferencing pointer to incomplete type
usb_st7554.c:763: error: dereferencing pointer to incomplete type
usb_st7554.c:763: error: dereferencing pointer to incomplete type
usb_st7554.c:764: error: dereferencing pointer to incomplete type
usb_st7554.c:764: error: dereferencing pointer to incomplete type
usb_st7554.c:765: error: dereferencing pointer to incomplete type
usb_st7554.c:765: error: dereferencing pointer to incomplete type
usb_st7554.c:765: error: dereferencing pointer to incomplete type
usb_st7554.c:765: error: dereferencing pointer to incomplete type
usb_st7554.c:765: error: dereferencing pointer to incomplete type
usb_st7554.c:765: error: dereferencing pointer to incomplete type
usb_st7554.c:765: error: dereferencing pointer to incomplete type
usb_st7554.c:765: error: dereferencing pointer to incomplete type
usb_st7554.c:765: error: dereferencing pointer to incomplete type
usb_st7554.c:765: error: dereferencing pointer to incomplete type
usb_st7554.c:765: error: dereferencing pointer to incomplete type
usb_st7554.c:766: error: dereferencing pointer to incomplete type
usb_st7554.c:766: error: dereferencing pointer to incomplete type
usb_st7554.c:767: error: dereferencing pointer to incomplete type
usb_st7554.c:767: error: dereferencing pointer to incomplete type
usb_st7554.c:767: error: dereferencing pointer to incomplete type
usb_st7554.c:767: error: dereferencing pointer to incomplete type
usb_st7554.c:767: error: dereferencing pointer to incomplete type
usb_st7554.c:767: error: dereferencing pointer to incomplete type
usb_st7554.c:767: error: dereferencing pointer to incomplete type
usb_st7554.c:767: error: dereferencing pointer to incomplete type
usb_st7554.c:767: error: dereferencing pointer to incomplete type
usb_st7554.c:767: error: dereferencing pointer to incomplete type
usb_st7554.c:767: error: dereferencing pointer to incomplete type
usb_st7554.c:769: error: dereferencing pointer to incomplete type
usb_st7554.c:770: error: dereferencing pointer to incomplete type
usb_st7554.c:771: error: dereferencing pointer to incomplete type
usb_st7554.c:771: error: dereferencing pointer to incomplete type
usb_st7554.c:775: error: dereferencing pointer to incomplete type
usb_st7554.c:775: error: dereferencing pointer to incomplete type
usb_st7554.c:776: error: dereferencing pointer to incomplete type
usb_st7554.c:776: error: dereferencing pointer to incomplete type
usb_st7554.c:777: error: dereferencing pointer to incomplete type
usb_st7554.c:777: error: dereferencing pointer to incomplete type
usb_st7554.c:778: error: dereferencing pointer to incomplete type
usb_st7554.c:778: error: dereferencing pointer to incomplete type
usb_st7554.c:781: error: dereferencing pointer to incomplete type
usb_st7554.c:785: error: dereferencing pointer to incomplete type
usb_st7554.c:786: error: dereferencing pointer to incomplete type
usb_st7554.c:789: error: dereferencing pointer to incomplete type
usb_st7554.c:790: error: dereferencing pointer to incomplete type
usb_st7554.c:791: error: dereferencing pointer to incomplete type
usb_st7554.c:794: error: dereferencing pointer to incomplete type
usb_st7554.c:795: error: dereferencing pointer to incomplete type
usb_st7554.c:796: error: dereferencing pointer to incomplete type
usb_st7554.c:810: error: dereferencing pointer to incomplete type
usb_st7554.c:810: error: dereferencing pointer to incomplete type
usb_st7554.c:814: error: dereferencing pointer to incomplete type
usb_st7554.c:762: warning: value computed is not used
usb_st7554.c:763: warning: value computed is not used
usb_st7554.c: In function `st7554_modem_stop':
usb_st7554.c:825: error: dereferencing pointer to incomplete type
usb_st7554.c:829: error: dereferencing pointer to incomplete type
usb_st7554.c:830: error: dereferencing pointer to incomplete type
usb_st7554.c:832: error: dereferencing pointer to incomplete type
usb_st7554.c:833: error: dereferencing pointer to incomplete type
usb_st7554.c:837: error: dereferencing pointer to incomplete type
usb_st7554.c:840: error: dereferencing pointer to incomplete type
usb_st7554.c:840: error: dereferencing pointer to incomplete type
usb_st7554.c:840: error: dereferencing pointer to incomplete type
usb_st7554.c:841: error: dereferencing pointer to incomplete type
usb_st7554.c:841: error: dereferencing pointer to incomplete type
usb_st7554.c:841: error: dereferencing pointer to incomplete type
usb_st7554.c: In function `st7554_modem_write':
usb_st7554.c:855: error: dereferencing pointer to incomplete type
usb_st7554.c:857: error: dereferencing pointer to incomplete type
usb_st7554.c:858: error: dereferencing pointer to incomplete type
usb_st7554.c:859: error: dereferencing pointer to incomplete type
usb_st7554.c: In function `st7554_modem_read':
usb_st7554.c:869: error: dereferencing pointer to incomplete type
usb_st7554.c:871: error: dereferencing pointer to incomplete type
usb_st7554.c:872: error: dereferencing pointer to incomplete type
usb_st7554.c:873: error: dereferencing pointer to incomplete type
usb_st7554.c: In function `st7554_modem_set_srate':
usb_st7554.c:882: error: dereferencing pointer to incomplete type
usb_st7554.c:884: error: dereferencing pointer to incomplete type
usb_st7554.c:886: error: dereferencing pointer to incomplete type
usb_st7554.c:887: error: dereferencing pointer to incomplete type
usb_st7554.c:888: error: dereferencing pointer to incomplete type
usb_st7554.c: In function `st7554_modem_set_format':
usb_st7554.c:897: error: dereferencing pointer to incomplete type
usb_st7554.c:898: error: dereferencing pointer to incomplete type
usb_st7554.c:900: error: dereferencing pointer to incomplete type
usb_st7554.c:902: error: dereferencing pointer to incomplete type
usb_st7554.c:903: error: dereferencing pointer to incomplete type
usb_st7554.c:904: error: dereferencing pointer to incomplete type
usb_st7554.c: In function `st7554_modem_set_frag':
usb_st7554.c:912: error: dereferencing pointer to incomplete type
usb_st7554.c:913: error: dereferencing pointer to incomplete type
usb_st7554.c:914: error: dereferencing pointer to incomplete type
usb_st7554.c: In function `st7554_modem_set_hook':
usb_st7554.c:923: error: dereferencing pointer to incomplete type
usb_st7554.c:925: error: dereferencing pointer to incomplete type
usb_st7554.c:932: error: dereferencing pointer to incomplete type
usb_st7554.c:934: error: dereferencing pointer to incomplete type
usb_st7554.c:935: error: dereferencing pointer to incomplete type
usb_st7554.c:936: error: dereferencing pointer to incomplete type
usb_st7554.c:937: error: dereferencing pointer to incomplete type
usb_st7554.c: In function `st7554_modem_ioctl':
usb_st7554.c:947: error: dereferencing pointer to incomplete type
usb_st7554.c:967: error: dereferencing pointer to incomplete type
usb_st7554.c:968: error: dereferencing pointer to incomplete type
usb_st7554.c:969: error: dereferencing pointer to incomplete type
usb_st7554.c:970: error: dereferencing pointer to incomplete type
usb_st7554.c:971: error: dereferencing pointer to incomplete type
usb_st7554.c:975: error: dereferencing pointer to incomplete type
usb_st7554.c:979: error: dereferencing pointer to incomplete type
usb_st7554.c:980: error: dereferencing pointer to incomplete type
usb_st7554.c:981: error: dereferencing pointer to incomplete type
usb_st7554.c: In function `st7554_modem_open':
usb_st7554.c:1002: error: dereferencing pointer to incomplete type
usb_st7554.c:1003: error: dereferencing pointer to incomplete type
usb_st7554.c:1012: error: dereferencing pointer to incomplete type
usb_st7554.c:1020: error: dereferencing pointer to incomplete type
usb_st7554.c:1034: error: dereferencing pointer to incomplete type
usb_st7554.c:1037: error: dereferencing pointer to incomplete type
usb_st7554.c:1037: error: dereferencing pointer to incomplete type
usb_st7554.c:1037: error: dereferencing pointer to incomplete type
usb_st7554.c:1037: error: dereferencing pointer to incomplete type
usb_st7554.c:1037: error: dereferencing pointer to incomplete type
usb_st7554.c:1037: error: dereferencing pointer to incomplete type
usb_st7554.c:1037: error: dereferencing pointer to incomplete type
usb_st7554.c:1038: error: dereferencing pointer to incomplete type
usb_st7554.c:1038: error: dereferencing pointer to incomplete type
usb_st7554.c:1038: error: dereferencing pointer to incomplete type
usb_st7554.c:1038: error: dereferencing pointer to incomplete type
usb_st7554.c:1038: error: dereferencing pointer to incomplete type
usb_st7554.c:1038: error: dereferencing pointer to incomplete type
usb_st7554.c:1038: error: dereferencing pointer to incomplete type
usb_st7554.c:1041: error: dereferencing pointer to incomplete type
usb_st7554.c:1041: error: dereferencing pointer to incomplete type
usb_st7554.c:1053: error: dereferencing pointer to incomplete type
usb_st7554.c: In function `st7554_modem_release':
usb_st7554.c:1067: error: dereferencing pointer to incomplete type
usb_st7554.c:1068: error: dereferencing pointer to incomplete type
usb_st7554.c:1069: error: dereferencing pointer to incomplete type
usb_st7554.c:1073: error: dereferencing pointer to incomplete type
usb_st7554.c: In function `st7554_get_reg':
usb_st7554.c:1135: error: dereferencing pointer to incomplete type
usb_st7554.c:1136: error: dereferencing pointer to incomplete type
usb_st7554.c:1136: error: dereferencing pointer to incomplete type
usb_st7554.c: In function `st7554_set_reg':
usb_st7554.c:1151: error: dereferencing pointer to incomplete type
usb_st7554.c:1152: error: dereferencing pointer to incomplete type
usb_st7554.c:1152: error: dereferencing pointer to incomplete type
usb_st7554.c: In function `stlc7550_set_srate':
usb_st7554.c:1166: error: dereferencing pointer to incomplete type
usb_st7554.c:1168: error: dereferencing pointer to incomplete type
usb_st7554.c:1170: error: dereferencing pointer to incomplete type
usb_st7554.c: In function `st7554_init':
usb_st7554.c:1236: error: dereferencing pointer to incomplete type
usb_st7554.c:1237: error: dereferencing pointer to incomplete type
usb_st7554.c:1238: error: dereferencing pointer to incomplete type
usb_st7554.c:1240: error: dereferencing pointer to incomplete type
usb_st7554.c:1241: error: dereferencing pointer to incomplete type
usb_st7554.c:1242: error: dereferencing pointer to incomplete type
usb_st7554.c:1243: error: dereferencing pointer to incomplete type
usb_st7554.c:1244: error: dereferencing pointer to incomplete type
usb_st7554.c:1245: error: dereferencing pointer to incomplete type
usb_st7554.c:1246: error: dereferencing pointer to incomplete type
usb_st7554.c:1248: error: dereferencing pointer to incomplete type
usb_st7554.c:1250: error: dereferencing pointer to incomplete type
usb_st7554.c:1252: error: dereferencing pointer to incomplete type
usb_st7554.c:1255: error: dereferencing pointer to incomplete type
usb_st7554.c:1255: error: dereferencing pointer to incomplete type
usb_st7554.c:1255: error: dereferencing pointer to incomplete type
usb_st7554.c:1255: error: dereferencing pointer to incomplete type
usb_st7554.c:1255: error: dereferencing pointer to incomplete type
usb_st7554.c:1256: error: dereferencing pointer to incomplete type
usb_st7554.c:1256: error: dereferencing pointer to incomplete type
usb_st7554.c:1256: error: dereferencing pointer to incomplete type
usb_st7554.c:1256: error: dereferencing pointer to incomplete type
usb_st7554.c:1256: error: dereferencing pointer to incomplete type
usb_st7554.c:1259: error: dereferencing pointer to incomplete type
usb_st7554.c:1259: error: dereferencing pointer to incomplete type
usb_st7554.c:1260: error: dereferencing pointer to incomplete type
usb_st7554.c: In function `st7554_release':
usb_st7554.c:1274: error: dereferencing pointer to incomplete type
usb_st7554.c:1276: error: dereferencing pointer to incomplete type
usb_st7554.c:1277: error: dereferencing pointer to incomplete type
usb_st7554.c:1279: error: dereferencing pointer to incomplete type
usb_st7554.c:1280: error: dereferencing pointer to incomplete type
usb_st7554.c:1282: error: dereferencing pointer to incomplete type
usb_st7554.c: In function `st7554_probe':
usb_st7554.c:1333: error: dereferencing pointer to incomplete type
usb_st7554.c:1338: error: dereferencing pointer to incomplete type
usb_st7554.c:1338: error: dereferencing pointer to incomplete type
usb_st7554.c:1338: error: dereferencing pointer to incomplete type
usb_st7554.c:1338: error: dereferencing pointer to incomplete type
usb_st7554.c:1338: error: dereferencing pointer to incomplete type
usb_st7554.c:1338: error: dereferencing pointer to incomplete type
usb_st7554.c:1340: error: dereferencing pointer to incomplete type
usb_st7554.c:1342: error: dereferencing pointer to incomplete type
usb_st7554.c:1343: error: dereferencing pointer to incomplete type
usb_st7554.c:1345: error: dereferencing pointer to incomplete type
usb_st7554.c:1349: error: dereferencing pointer to incomplete type
usb_st7554.c:1349: error: dereferencing pointer to incomplete type
usb_st7554.c:1349: error: dereferencing pointer to incomplete type
usb_st7554.c:1349: error: dereferencing pointer to incomplete type
usb_st7554.c:1349: error: dereferencing pointer to incomplete type
usb_st7554.c:1349: error: dereferencing pointer to incomplete type
usb_st7554.c:1349: error: dereferencing pointer to incomplete type
usb_st7554.c:1349: error: dereferencing pointer to incomplete type
usb_st7554.c:1349: error: dereferencing pointer to incomplete type
usb_st7554.c:1349: error: dereferencing pointer to incomplete type
usb_st7554.c:1349: error: dereferencing pointer to incomplete type
usb_st7554.c:1349: error: dereferencing pointer to incomplete type
usb_st7554.c:1349: error: dereferencing pointer to incomplete type
usb_st7554.c:1355: error: dereferencing pointer to incomplete type
usb_st7554.c:1357: error: dereferencing pointer to incomplete type
usb_st7554.c:1358: error: dereferencing pointer to incomplete type
usb_st7554.c:1359: error: dereferencing pointer to incomplete type
usb_st7554.c:1360: error: dereferencing pointer to incomplete type
usb_st7554.c:1362: error: dereferencing pointer to incomplete type
usb_st7554.c:1363: error: dereferencing pointer to incomplete type
usb_st7554.c:1365: error: dereferencing pointer to incomplete type
usb_st7554.c:1366: error: dereferencing pointer to incomplete type
usb_st7554.c:1369: error: dereferencing pointer to incomplete type
usb_st7554.c:1376: error: dereferencing pointer to incomplete type
usb_st7554.c:1381: error: dereferencing pointer to incomplete type
usb_st7554.c:1382: error: dereferencing pointer to incomplete type
usb_st7554.c:1383: error: dereferencing pointer to incomplete type
usb_st7554.c:1394: error: dereferencing pointer to incomplete type
usb_st7554.c:1401: error: dereferencing pointer to incomplete type
usb_st7554.c: In function `st7554_disconnect':
usb_st7554.c:1419: error: dereferencing pointer to incomplete type
usb_st7554.c:1425: error: dereferencing pointer to incomplete type
usb_st7554.c:1427: error: dereferencing pointer to incomplete type
usb_st7554.c:1428: error: dereferencing pointer to incomplete type
usb_st7554.c:1434: error: dereferencing pointer to incomplete type
usb_st7554.c:1439: error: dereferencing pointer to incomplete type
make: *** [usb_st7554.o] Error 1
root@box:~/slmdm-2.6.16#





-- Email.it, the professional e-mail, gratis per te: http://www.email.it/f

Sponsor:
Per l?Upgrade del tuo PC scegli Upgrade Pack? Scheda Madre,
* Processore e Memoria preassemblati, pronti da installare sul tuo PC?
Clicca qui: http://adv.email.it/cgi-bin/foclick.cgi?mid=2651&d=27-73&d=27-7
========---------- Prima di scrivere in m-list per favore leggi il regolamento http://www.lugge.net/soci/index.php?link=manifesto


Archivio delle e-mail postate in lista http://www.freelists.org/archives/lugge/

Modifica dell'account sulla lista LUGGe http://www.lugge.net/soci/index.php?link=manifesto.htm#list

Other related posts: