[haiku-bugs] [Haiku] #16706: THR: Test FAILED - conformance/interfaces/pthread_detach/4-1.test

  • From: "Haiku" <trac@xxxxxxxxxxxx>
  • To: undisclosed-recipients: ;
  • Date: Tue, 29 Dec 2020 04:18:43 -0000

#16706: THR: Test FAILED - conformance/interfaces/pthread_detach/4-1.test
---------------------------------------------+-----------------------------
 Reporter:  cocobean                         |       Owner:  nobody
     Type:  bug                              |      Status:  new
 Priority:  normal                           |   Milestone:  Unscheduled
Component:  System/POSIX                     |     Version:  R1/Development
 Keywords:  POSIX, pthreads, pthread_detach  |  Blocked By:
 Blocking:                                   |    Platform:  All
---------------------------------------------+-----------------------------
 Test that pthread_detach()

 Upon failure, it shall return an error number:

 -[EINVAL] The implemenation has detected that the value specified by
 'thread' does not refer to a joinable thread.

 -[ESRCH] No thread could be found corresponding to that thread. It shall
 not return an error code of [EINTR]

 STEPS:
 {{{
 1.Create a detached state thread
 2.Detach that thread
 3.Check the return value and make sure it is EINVAL
 }}}


 Ref:
 
‚Äčhttps://github.com/haiku/open_posix_testsuite/blob/from_haiku_trunk/conformance/interfaces/pthread_detach/4-1.c

 Expected result: Test passed

 Actual Result: Test failed. Incorrect error code

 Tested on: Haiku hrev54815 x86 with Open POSIX Test Suite 1.5.2
-- 
Ticket URL: <https://dev.haiku-os.org/ticket/16706>
Haiku <https://dev.haiku-os.org>
The Haiku operating system.

Other related posts:

  • » [haiku-bugs] [Haiku] #16706: THR: Test FAILED - conformance/interfaces/pthread_detach/4-1.test - Haiku