[kismac] Re: problem compiling cvs

  • From: Michael Rossberg <mick@xxxxxxxxxxxxxxxx>
  • To: kismac@xxxxxxxxxxxxx
  • Date: Sat, 10 Jan 2004 13:18:03 +0100

Hi Theodore,

make sure you have the 10.2 SDK installed. or disable cross compiling in the project preferences.

mick

On 10. Jan 2004, at 12:31 Uhr, Theodore wrote:

-----BEGIN PGP SIGNED MESSAGE-----
Hash: SHA1

Hi:

I was wanting to compile from CVS (to fix the scroll bug) but something is either wrong with what i'm doing, or wrong with my setup.

I get the following error when trying to compile:

$ xcodebuild
=== BUILDING NATIVE TARGET KisMAC Driver Tool WITHOUT USING ANY BUILD STYLE ===


CompileC "build/KisMAC.build/KisMAC Driver Tool.build/Objects-normal/ppc/DriveController.o" "Driver Tool/DriveController.m" normal ppc objective-c com.apple.compilers.gcc.3_3
setenv MACOSX_DEPLOYMENT_TARGET 10.2
setenv NEXT_ROOT /Developer/SDKs/MacOSX10.2.7.sdk
cd /Users/theodore/KisMAC
/usr/bin/gcc-3.3 -x objective-c -arch ppc -pipe -Wno-trigraphs - -fasm-blocks -fpascal-strings -O3 -mtune=G4 -Wno-four-char-constants - -Wmost -fmessage-length=0 -F/Users/theodore/KisMAC/build - -I/Users/theodore/KisMAC/build/include -isystem /Developer/SDKs/MacOSX10.2.7.sdk/usr/include "-I/Users/theodore/KisMAC/build/KisMAC.build/KisMAC Driver Tool.build/DerivedSources" "-Wp,-header-mapfile,/Users/theodore/KisMAC/build/KisMAC.build/KisMAC Driver Tool.build/KisMAC Driver Tool.hmap" -c "/Users/theodore/KisMAC/Driver Tool/DriveController.m" -o "/Users/theodore/KisMAC/build/KisMAC.build/KisMAC Driver Tool.build/Objects-normal/ppc/DriveController.o"
In file included from /Users/theodore/KisMAC/Driver Tool/DriveController.m:25:
/Users/theodore/KisMAC/Driver Tool/DriveController.h:25:24: Cocoa/Cocoa.h: No such file or directory
In file included from /Users/theodore/KisMAC/Driver Tool/DriveController.m:25:
/Users/theodore/KisMAC/Driver Tool/DriveController.h:29: error: parse error before "IBOutlet"
/Users/theodore/KisMAC/Driver Tool/DriveController.h:33: error: cannot find interface declaration for `NSObject', superclass of `DriveController'
** BUILD FAILED **
2004-01-10 05:24:47.298 xcodebuild[1985] Container <PBXProject:0x00399550:rtn=1:29B97313FDCFA39411CA2CEA:path='(null)'> still contains 1 items after being deallocated. This might be a memory leak, or an item not being properly marked as removed from its container before being deallocated.


I'm wondering if I'm missing a required set of headers or something

I've got the developers kit that came with Panther, as well as the 1.1 patch for it
Panther 10.3.2


Anyone else run into this?

Thanks

Theodore
-----BEGIN PGP SIGNATURE-----
Version: GnuPG v1.2.4 (Darwin)

iD8DBQE//+KF0JaVqhiMFbARAgcgAJ9P0NLzX17VE5Ffps/I5VvG55sbHQCfSnhp
AsvOEsETceBpTDn5pgDCm38=
=SFX/
-----END PGP SIGNATURE-----

Other related posts: